Servoy 2022.09 release candidate 1

Release notes for Servoy betas

Servoy 2022.09 release candidate 1

Postby jcompagner » Tue Sep 06, 2022 12:03 am

We are pleased to announce the availability of Servoy 2022.09 release candidate 1 (release number 3800)

For Windows the installer: exe
and for the MacOSX_86_64 we have an native dmg
and for the MacOSX_Aarch64 (M1) we have an native m1 dmg
for linux it is tar.gz

For windows we also still have just the zip

An installation (coming from the normal installer or from a platform specific archive) is shipping with with a Java VM (Java 17.0.4)

So for the platform specific archives you don't need to install or have java on your system.

The developer can be updated by the https://download.servoy.com/developer/l ... ecandidate update site url.
This is in our "latest" release stream (03,06,09,12) if you want to stick the LTS release then disable that releasecandidate url and stick to the urls with "lts" in the name
If you update to this release you have to do a new install of 2022.03.2_lts to go back to an the LTS release branch

See whats new for the global changes

See the issues list for a complete overview of all the cases.

Make sure you use all the latest webpackages that also have the 2022.09.x version
Older versions won't work in combination with Servoy 2022.09
Johan Compagner
Servoy
User avatar
jcompagner
 
Posts: 8840
Joined: Tue May 27, 2003 7:26 pm
Location: The Internet

Re: Servoy 2022.09 release candidate 1

Postby steve1376656734 » Thu Sep 08, 2022 3:18 pm

Have downloaded the RC1 and tcreated a brand new project. The project includes the standard Servoy modules (navigation, security, search, utils).

Once the packages are downloaded the build starts in the Ti NG console and I get the following error:
Code: Select all
/Users/stevehawes/servoy_workspace_3800/.metadata/.plugins/com.servoy.eclipse.ngclient.ui/node-v16.17.0-darwin-arm64/bin/node
/Users/stevehawes/servoy_workspace_3800/.metadata/.plugins/com.servoy.eclipse.ngclient.ui/node-v16.17.0-darwin-arm64/lib/node_modules/npm/bin/npm-cli.js
update --legacy-peer-deps
In dir: /Users/stevehawes/servoy_workspace_3800/.metadata/.plugins/com.servoy.eclipse.ngclient.ui/target/test
npm ERR! code 1
npm ERR! path /Users/stevehawes/servoy_workspace_3800/.metadata/.plugins/com.servoy.eclipse.ngclient.ui/target/node_modules/nx
npm ERR! command failed
npm ERR! command sh /var/folders/dq/m3y_p8ss4177bhchfwvk12f00000gn/T/postinstall-a5cb7b3a.sh
npm ERR! node:internal/modules/cjs/loader:959
npm ERR!   throw err;
npm ERR!   ^
npm ERR!
npm ERR! Error: Cannot find module './lib/stringify'
npm ERR! Require stack:
npm ERR! - /Users/stevehawes/servoy_workspace_3800/.metadata/.plugins/com.servoy.eclipse.ngclient.ui/target/node_modules/braces/index.js
npm ERR! - /Users/stevehawes/servoy_workspace_3800/.metadata/.plugins/com.servoy.eclipse.ngclient.ui/target/node_modules/micromatch/index.js
npm ERR! - /Users/stevehawes/servoy_workspace_3800/.metadata/.plugins/com.servoy.eclipse.ngclient.ui/target/node_modules/nx/node_modules/fast-glob/out/utils/pattern.js
npm ERR! - /Users/stevehawes/servoy_workspace_3800/.metadata/.plugins/com.servoy.eclipse.ngclient.ui/target/node_modules/nx/node_modules/fast-glob/out/utils/index.js
npm ERR! - /Users/stevehawes/servoy_workspace_3800/.metadata/.plugins/com.servoy.eclipse.ngclient.ui/target/node_modules/nx/node_modules/fast-glob/out/managers/tasks.js
npm ERR! - /Users/stevehawes/servoy_workspace_3800/.metadata/.plugins/com.servoy.eclipse.ngclient.ui/target/node_modules/nx/node_modules/fast-glob/out/index.js
npm ERR! - /Users/stevehawes/servoy_workspace_3800/.metadata/.plugins/com.servoy.eclipse.ngclient.ui/target/node_modules/nx/src/config/workspaces.js
npm ERR! - /Users/stevehawes/servoy_workspace_3800/.metadata/.plugins/com.servoy.eclipse.ngclient.ui/target/node_modules/nx/src/project-graph/file-utils.js
npm ERR! - /Users/stevehawes/servoy_workspace_3800/.metadata/.plugins/com.servoy.eclipse.ngclient.ui/target/node_modules/nx/src/project-graph/build-dependencies/typescript-import-locator.js
npm ERR! - /Users/stevehawes/servoy_workspace_3800/.metadata/.plugins/com.servoy.eclipse.ngclient.ui/target/node_modules/nx/src/project-graph/build-dependencies/explicit-project-dependencies.js
npm ERR! - /Users/stevehawes/servoy_workspace_3800/.metadata/.plugins/com.servoy.eclipse.ngclient.ui/target/node_modules/nx/src/project-graph/build-dependencies/index.js
npm ERR! - /Users/stevehawes/servoy_workspace_3800/.metadata/.plugins/com.servoy.eclipse.ngclient.ui/target/node_modules/nx/src/project-graph/build-project-graph.js
npm ERR! - /Users/stevehawes/servoy_workspace_3800/.metadata/.plugins/com.servoy.eclipse.ngclient.ui/target/node_modules/nx/src/project-graph/project-graph.js
npm ERR! - /Users/stevehawes/servoy_workspace_3800/.metadata/.plugins/com.servoy.eclipse.ngclient.ui/target/node_modules/nx/bin/compute-project-graph.js
npm ERR!     at Function.Module._resolveFilename (node:internal/modules/cjs/loader:956:15)
npm ERR!     at Function.Module._load (node:internal/modules/cjs/loader:804:27)
npm ERR!     at Module.require (node:internal/modules/cjs/loader:1028:19)
npm ERR!     at require (node:internal/modules/cjs/helpers:102:18)
npm ERR!     at Object.<anonymous> (/Users/stevehawes/servoy_workspace_3800/.metadata/.plugins/com.servoy.eclipse.ngclient.ui/target/node_modules/braces/index.js:3:19)
npm ERR!     at Module._compile (node:internal/modules/cjs/loader:1126:14)
npm ERR!     at Object.Module._extensions..js (node:internal/modules/cjs/loader:1180:10)
npm ERR!     at Module.load (node:internal/modules/cjs/loader:1004:32)
npm ERR!     at Function.Module._load (node:internal/modules/cjs/loader:839:12)
npm ERR!     at Module.require (node:internal/modules/cjs/loader:1028:19) {
npm ERR!   code: 'MODULE_NOT_FOUND',
npm ERR!   requireStack: [
npm ERR!     '/Users/stevehawes/servoy_workspace_3800/.metadata/.plugins/com.servoy.eclipse.ngclient.ui/target/node_modules/braces/index.js',
npm ERR!     '/Users/stevehawes/servoy_workspace_3800/.metadata/.plugins/com.servoy.eclipse.ngclient.ui/target/node_modules/micromatch/index.js',
npm ERR!     '/Users/stevehawes/servoy_workspace_3800/.metadata/.plugins/com.servoy.eclipse.ngclient.ui/target/node_modules/nx/node_modules/fast-glob/out/utils/pattern.js',
npm ERR!     '/Users/stevehawes/servoy_workspace_3800/.metadata/.plugins/com.servoy.eclipse.ngclient.ui/target/node_modules/nx/node_modules/fast-glob/out/utils/index.js',
npm ERR!     '/Users/stevehawes/servoy_workspace_3800/.metadata/.plugins/com.servoy.eclipse.ngclient.ui/target/node_modules/nx/node_modules/fast-glob/out/managers/tasks.js',
npm ERR!     '/Users/stevehawes/servoy_workspace_3800/.metadata/.plugins/com.servoy.eclipse.ngclient.ui/target/node_modules/nx/node_modules/fast-glob/out/index.js',
npm ERR!     '/Users/stevehawes/servoy_workspace_3800/.metadata/.plugins/com.servoy.eclipse.ngclient.ui/target/node_modules/nx/src/config/workspaces.js',
npm ERR!     '/Users/stevehawes/servoy_workspace_3800/.metadata/.plugins/com.servoy.eclipse.ngclient.ui/target/node_modules/nx/src/project-graph/file-utils.js',
npm ERR!     '/Users/stevehawes/servoy_workspace_3800/.metadata/.plugins/com.servoy.eclipse.ngclient.ui/target/node_modules/nx/src/project-graph/build-dependencies/typescript-import-locator.js',
npm ERR!     '/Users/stevehawes/servoy_workspace_3800/.metadata/.plugins/com.servoy.eclipse.ngclient.ui/target/node_modules/nx/src/project-graph/build-dependencies/explicit-project-dependencies.js',
npm ERR!     '/Users/stevehawes/servoy_workspace_3800/.metadata/.plugins/com.servoy.eclipse.ngclient.ui/target/node_modules/nx/src/project-graph/build-dependencies/index.js',
npm ERR!     '/Users/stevehawes/servoy_workspace_3800/.metadata/.plugins/com.servoy.eclipse.ngclient.ui/target/node_modules/nx/src/project-graph/build-project-graph.js',
npm ERR!     '/Users/stevehawes/servoy_workspace_3800/.metadata/.plugins/com.servoy.eclipse.ngclient.ui/target/node_modules/nx/src/project-graph/project-graph.js',
npm ERR!     '/Users/stevehawes/servoy_workspace_3800/.metadata/.plugins/com.servoy.eclipse.ngclient.ui/target/node_modules/nx/bin/compute-project-graph.js'
npm ERR!   ]
npm ERR! }


Am unable to go any further.
Steve
SAN Developer
There are 10 types of people in the world - those that understand binary and those that don't
steve1376656734
 
Posts: 334
Joined: Fri Aug 16, 2013 2:38 pm
Location: Ashford, UK

Re: Servoy 2022.09 release candidate 1

Postby steve1376656734 » Thu Sep 08, 2022 3:26 pm

Tried creating a brand new workspace in case it was a workspace corruption issue and am now getting the following error:

Code: Select all
- @angular-slider/ngx-slider [es2015/esm2015] (https://github.com/angular-slider/ngx-slider.git)
✔ Browser application bundle generation complete.
✔ Browser application bundle generation complete.

./src/main.ts - Error: Module build failed (from ../node_modules/@ngtools/webpack/src/ivy/index.js):
Error: Cannot resolve type entity i3.DialogModule to symbol

./src/polyfills.ts - Error: Module build failed (from ../node_modules/@ngtools/webpack/src/ivy/index.js):
Error: Cannot resolve type entity i3.DialogModule to symbol

Error: node_modules/@angular/material/dialog/index.d.ts:3:36 - error TS2307: Cannot find module '@angular/cdk/dialog' or its corresponding type declarations.

3 import { CdkDialogContainer } from '@angular/cdk/dialog';
~~~~~~~~~~~~~~~~~~~~~


Error: node_modules/@angular/material/dialog/index.d.ts:7:27 - error TS2307: Cannot find module '@angular/cdk/dialog' or its corresponding type declarations.

7 import { DialogRef } from '@angular/cdk/dialog';
~~~~~~~~~~~~~~~~~~~~~


Error: node_modules/@angular/material/dialog/index.d.ts:15:21 - error TS2307: Cannot find module '@angular/cdk/dialog' or its corresponding type declarations.

15 import * as i3 from '@angular/cdk/dialog';
~~~~~~~~~~~~~~~~~~~~~


This happens right at the end of the build process. The full build log is:

Code: Select all
---- Start to check to copy the Titanium NG sources
Tested package.json which is changed, starting to copy 0s
Copied all the sources 0s
Total time to copy done 0s


---- Running npm command:
/Users/stevehawes/servoy_workspace_3800_2/.metadata/.plugins/com.servoy.eclipse.ngclient.ui/node-v16.17.0-darwin-arm64/bin/node
/Users/stevehawes/servoy_workspace_3800_2/.metadata/.plugins/com.servoy.eclipse.ngclient.ui/node-v16.17.0-darwin-arm64/lib/node_modules/npm/bin/npm-cli.js
install --legacy-peer-deps
In dir: /Users/stevehawes/servoy_workspace_3800_2/.metadata/.plugins/com.servoy.eclipse.ngclient.ui/target
---- Starting Titanium NGClient source check (14:20:53.880384)
No generated files, build will be triggered
need to install package /Users/stevehawes/servoy_workspace_3800_2/.metadata/.plugins/com.servoy.eclipse.ngclient.ui/target/test/projects/dialogs
need to install package /Users/stevehawes/servoy_workspace_3800_2/.metadata/.plugins/com.servoy.eclipse.ngclient.ui/target/test/projects/ngclientutils
need to install package /Users/stevehawes/servoy_workspace_3800_2/.metadata/.plugins/com.servoy.eclipse.ngclient.ui/target/test/projects/window
services ts file changed
LFC components ts file changed
components ts file changed
editor ts file changed
component modules  ts file changed
Styles source changed
Assets source changed

---- Running npm command:
/Users/stevehawes/servoy_workspace_3800_2/.metadata/.plugins/com.servoy.eclipse.ngclient.ui/node-v16.17.0-darwin-arm64/bin/node
/Users/stevehawes/servoy_workspace_3800_2/.metadata/.plugins/com.servoy.eclipse.ngclient.ui/node-v16.17.0-darwin-arm64/lib/node_modules/npm/bin/npm-cli.js
install /Users/stevehawes/servoy_workspace_3800_2/.metadata/.plugins/com.servoy.eclipse.ngclient.ui/target/test/packages/@servoy/nggrids/dist/servoy/nggrids
/Users/stevehawes/servoy_workspace_3800_2/.metadata/.plugins/com.servoy.eclipse.ngclient.ui/target/test/packages/@servoy/servoyextracomponents/dist/servoy/servoyextracomponents
/Users/stevehawes/servoy_workspace_3800_2/.metadata/.plugins/com.servoy.eclipse.ngclient.ui/target/test/projects/dialogs
/Users/stevehawes/servoy_workspace_3800_2/.metadata/.plugins/com.servoy.eclipse.ngclient.ui/target/test/projects/window
/Users/stevehawes/servoy_workspace_3800_2/.metadata/.plugins/com.servoy.eclipse.ngclient.ui/target/test/packages/@servoy/bootstrapextracomponents/dist/servoy/bootstrapextracomponents
/Users/stevehawes/servoy_workspace_3800_2/.metadata/.plugins/com.servoy.eclipse.ngclient.ui/target/test/projects/servoydefault
/Users/stevehawes/servoy_workspace_3800_2/.metadata/.plugins/com.servoy.eclipse.ngclient.ui/target/test/packages/@servoy/bootstrapcomponents/dist/servoy/bootstrapcomponents
/Users/stevehawes/servoy_workspace_3800_2/.metadata/.plugins/com.servoy.eclipse.ngclient.ui/target/test/packages/@servoy/12grid/dist/12grid
/Users/stevehawes/servoy_workspace_3800_2/.metadata/.plugins/com.servoy.eclipse.ngclient.ui/target/test/projects/ngclientutils
--legacy-peer-deps
In dir: /Users/stevehawes/servoy_workspace_3800_2/.metadata/.plugins/com.servoy.eclipse.ngclient.ui/target/test

added 118 packages, and audited 128 packages in 26s

7 packages are looking for funding
run `npm fund` for details

found 0 vulnerabilities
Finished running 'install /Users/stevehawes/servoy_workspace_3800_2/.metadata/.plugins/com.servoy.eclipse.ngclient.ui/target/test/packages/@servoy/nggrids/dist/servoy/nggrids
/Users/stevehawes/servoy_workspace_3800_2/.metadata/.plugins/com.servoy.eclipse.ngclient.ui/target/test/packages/@servoy/servoyextracomponents/dist/servoy/servoyextracomponents
/Users/stevehawes/servoy_workspace_3800_2/.metadata/.plugins/com.servoy.eclipse.ngclient.ui/target/test/projects/dialogs
/Users/stevehawes/servoy_workspace_3800_2/.metadata/.plugins/com.servoy.eclipse.ngclient.ui/target/test/projects/window
/Users/stevehawes/servoy_workspace_3800_2/.metadata/.plugins/com.servoy.eclipse.ngclient.ui/target/test/packages/@servoy/bootstrapextracomponents/dist/servoy/bootstrapextracomponents
/Users/stevehawes/servoy_workspace_3800_2/.metadata/.plugins/com.servoy.eclipse.ngclient.ui/target/test/projects/servoydefault
/Users/stevehawes/servoy_workspace_3800_2/.metadata/.plugins/com.servoy.eclipse.ngclient.ui/target/test/packages/@servoy/bootstrapcomponents/dist/servoy/bootstrapcomponents
/Users/stevehawes/servoy_workspace_3800_2/.metadata/.plugins/com.servoy.eclipse.ngclient.ui/target/test/packages/@servoy/12grid/dist/12grid
/Users/stevehawes/servoy_workspace_3800_2/.metadata/.plugins/com.servoy.eclipse.ngclient.ui/target/test/projects/ngclientutils
--legacy-peer-deps ' time: 26s


---- Running npm command:
/Users/stevehawes/servoy_workspace_3800_2/.metadata/.plugins/com.servoy.eclipse.ngclient.ui/node-v16.17.0-darwin-arm64/bin/node
/Users/stevehawes/servoy_workspace_3800_2/.metadata/.plugins/com.servoy.eclipse.ngclient.ui/node-v16.17.0-darwin-arm64/lib/node_modules/npm/bin/npm-cli.js
update --legacy-peer-deps
In dir: /Users/stevehawes/servoy_workspace_3800_2/.metadata/.plugins/com.servoy.eclipse.ngclient.ui/target/test

added 14 packages, removed 14 packages, changed 5 packages, and audited 128 packages in 2s

7 packages are looking for funding
run `npm fund` for details

found 0 vulnerabilities
Finished running 'update --legacy-peer-deps ' time: 2s


---- Running npm command:
/Users/stevehawes/servoy_workspace_3800_2/.metadata/.plugins/com.servoy.eclipse.ngclient.ui/node-v16.17.0-darwin-arm64/bin/node
/Users/stevehawes/servoy_workspace_3800_2/.metadata/.plugins/com.servoy.eclipse.ngclient.ui/node-v16.17.0-darwin-arm64/lib/node_modules/npm/bin/npm-cli.js
dedup
In dir: /Users/stevehawes/servoy_workspace_3800_2/.metadata/.plugins/com.servoy.eclipse.ngclient.ui/target/test

added 1 package, removed 2 packages, changed 1 package, and audited 127 packages in 568ms

7 packages are looking for funding
run `npm fund` for details

found 0 vulnerabilities
Finished running 'dedup ' time: 0s

None NPM dedup time (root node_modules/solution node_modules): 0s

---- Running npm command:
/Users/stevehawes/servoy_workspace_3800_2/.metadata/.plugins/com.servoy.eclipse.ngclient.ui/node-v16.17.0-darwin-arm64/bin/node
/Users/stevehawes/servoy_workspace_3800_2/.metadata/.plugins/com.servoy.eclipse.ngclient.ui/node-v16.17.0-darwin-arm64/lib/node_modules/npm/bin/npm-cli.js
run build_debug_nowatch
In dir: /Users/stevehawes/servoy_workspace_3800_2/.metadata/.plugins/com.servoy.eclipse.ngclient.ui/target/test

> ngclient2@2022.9.0 build_debug_nowatch
> ng build ngclient2 --watch=false

/var/folders/dq/m3y_p8ss4177bhchfwvk12f00000gn/T/build_debug_nowatch-840db5d2.sh: line 1: ng: command not found
Finished running 'run build_debug_nowatch ' time: 0s

Total time to check/install Titanium NG target folder: /Users/stevehawes/servoy_workspace_3800_2/.metadata/.plugins/com.servoy.eclipse.ngclient.ui/target/test is 30s

npm WARN deprecated source-map-resolve@0.6.0: See https://github.com/lydell/source-map-resolve#deprecated

added 1172 packages, and audited 1173 packages in 1m

184 packages are looking for funding
run `npm fund` for details

found 0 vulnerabilities
Finished running 'install --legacy-peer-deps ' time: 70s

---- Starting Titanium NGClient source check (14:22:04.162468)
No generated files, build will be triggered

---- Running npm command:
/Users/stevehawes/servoy_workspace_3800_2/.metadata/.plugins/com.servoy.eclipse.ngclient.ui/node-v16.17.0-darwin-arm64/bin/node
/Users/stevehawes/servoy_workspace_3800_2/.metadata/.plugins/com.servoy.eclipse.ngclient.ui/node-v16.17.0-darwin-arm64/lib/node_modules/npm/bin/npm-cli.js
install --legacy-peer-deps
In dir: /Users/stevehawes/servoy_workspace_3800_2/.metadata/.plugins/com.servoy.eclipse.ngclient.ui/target/test

up to date, audited 127 packages in 539ms

7 packages are looking for funding
run `npm fund` for details

found 0 vulnerabilities
Finished running 'install --legacy-peer-deps ' time: 0s


---- Running npm command:
/Users/stevehawes/servoy_workspace_3800_2/.metadata/.plugins/com.servoy.eclipse.ngclient.ui/node-v16.17.0-darwin-arm64/bin/node
/Users/stevehawes/servoy_workspace_3800_2/.metadata/.plugins/com.servoy.eclipse.ngclient.ui/node-v16.17.0-darwin-arm64/lib/node_modules/npm/bin/npm-cli.js
update --legacy-peer-deps
In dir: /Users/stevehawes/servoy_workspace_3800_2/.metadata/.plugins/com.servoy.eclipse.ngclient.ui/target/test

added 2 packages, removed 1 package, changed 1 package, and audited 128 packages in 738ms

7 packages are looking for funding
run `npm fund` for details

found 0 vulnerabilities
Finished running 'update --legacy-peer-deps ' time: 0s


---- Running npm command:
/Users/stevehawes/servoy_workspace_3800_2/.metadata/.plugins/com.servoy.eclipse.ngclient.ui/node-v16.17.0-darwin-arm64/bin/node
/Users/stevehawes/servoy_workspace_3800_2/.metadata/.plugins/com.servoy.eclipse.ngclient.ui/node-v16.17.0-darwin-arm64/lib/node_modules/npm/bin/npm-cli.js
dedup
In dir: /Users/stevehawes/servoy_workspace_3800_2/.metadata/.plugins/com.servoy.eclipse.ngclient.ui/target/test

added 1 package, removed 2 packages, changed 1 package, and audited 127 packages in 597ms

7 packages are looking for funding
run `npm fund` for details

found 0 vulnerabilities
Finished running 'dedup ' time: 0s

None NPM dedup time (root node_modules/solution node_modules): 0s

---- Running npm command:
/Users/stevehawes/servoy_workspace_3800_2/.metadata/.plugins/com.servoy.eclipse.ngclient.ui/node-v16.17.0-darwin-arm64/bin/node
/Users/stevehawes/servoy_workspace_3800_2/.metadata/.plugins/com.servoy.eclipse.ngclient.ui/node-v16.17.0-darwin-arm64/lib/node_modules/npm/bin/npm-cli.js
run build_debug_nowatch
In dir: /Users/stevehawes/servoy_workspace_3800_2/.metadata/.plugins/com.servoy.eclipse.ngclient.ui/target/test

> ngclient2@2022.9.0 build_debug_nowatch
> ng build ngclient2 --watch=false

- Generating browser application bundles (phase: setup)...

- jw-bootstrap-switch-ng2 [es2015/esm2015] (https://github.com/JulioWar/jw-bootstrap-switch-ng2.git)
DeprecationWarning: 'getMutableClone' has been deprecated since v4.0.0. Use an appropriate `factory.update...` method instead, use `setCommentRange` or `setSourceMapRange`, and avoid setting `parent`.

- @circlon/angular-tree-component [es2015/esm2015] (https://github.com/CirclonGroup/angular-tree-component.git)

- ng2-file-upload [es2015/esm2015] ()

- ngx-filesaver [es2015/esm2015] (git+https://github.com/cipchk/ngx-filesaver.git)

- ngx-lightbox [main/commonjs] (git+https://github.com/themyth92/ngx-lightbox.git)

- ngx-infinite-scroll [es2015/esm2015] (https://github.com/orizens/ngx-infinite-scroll.git)

- ng-select2-component [es2015/esm2015] (git+https://github.com/Harvest-Dev/ng-select2.git)

- @angular-slider/ngx-slider [es2015/esm2015] (https://github.com/angular-slider/ngx-slider.git)
✔ Browser application bundle generation complete.
✔ Browser application bundle generation complete.

./src/main.ts - Error: Module build failed (from ../node_modules/@ngtools/webpack/src/ivy/index.js):
Error: Cannot resolve type entity i3.DialogModule to symbol

./src/polyfills.ts - Error: Module build failed (from ../node_modules/@ngtools/webpack/src/ivy/index.js):
Error: Cannot resolve type entity i3.DialogModule to symbol

Error: node_modules/@angular/material/dialog/index.d.ts:3:36 - error TS2307: Cannot find module '@angular/cdk/dialog' or its corresponding type declarations.

3 import { CdkDialogContainer } from '@angular/cdk/dialog';
~~~~~~~~~~~~~~~~~~~~~


Error: node_modules/@angular/material/dialog/index.d.ts:7:27 - error TS2307: Cannot find module '@angular/cdk/dialog' or its corresponding type declarations.

7 import { DialogRef } from '@angular/cdk/dialog';
~~~~~~~~~~~~~~~~~~~~~


Error: node_modules/@angular/material/dialog/index.d.ts:15:21 - error TS2307: Cannot find module '@angular/cdk/dialog' or its corresponding type declarations.

15 import * as i3 from '@angular/cdk/dialog';
~~~~~~~~~~~~~~~~~~~~~



Finished running 'run build_debug_nowatch ' time: 18s

Total time to check/install Titanium NG target folder: /Users/stevehawes/servoy_workspace_3800_2/.metadata/.plugins/com.servoy.eclipse.ngclient.ui/target/test is 21s

Steve
SAN Developer
There are 10 types of people in the world - those that understand binary and those that don't
steve1376656734
 
Posts: 334
Joined: Fri Aug 16, 2013 2:38 pm
Location: Ashford, UK

Re: Servoy 2022.09 release candidate 1

Postby steve1376656734 » Thu Sep 08, 2022 3:53 pm

OK - looks like the versions of the component packages that are installed when you create a new project are out of date (2022.3 etc.) and you need to update them before your project will complete it's first build.
Steve
SAN Developer
There are 10 types of people in the world - those that understand binary and those that don't
steve1376656734
 
Posts: 334
Joined: Fri Aug 16, 2013 2:38 pm
Location: Ashford, UK

Re: Servoy 2022.09 release candidate 1

Postby steve1376656734 » Thu Sep 08, 2022 4:40 pm

Tried to import a solution exported from 2022.06 and got the following error:

Code: Select all
Could not import solution: org.json.JSONException: JSONObject["uuid"] not found.

The solution was the one attached to SVY-17427
Steve
SAN Developer
There are 10 types of people in the world - those that understand binary and those that don't
steve1376656734
 
Posts: 334
Joined: Fri Aug 16, 2013 2:38 pm
Location: Ashford, UK

Re: Servoy 2022.09 release candidate 1

Postby steve1376656734 » Fri Sep 09, 2022 11:17 am

There seems to be a new event (onBeforeHide) on forms that is not mentioned in the release notes.

Also the properties pane seems to have lost the banding for the rows and the column gridline.

2022.9:
2022-09 properties.png
2022-09 properties.png (14.03 KiB) Viewed 7348 times


2022.6:
2022-6 properties.png
2022-6 properties.png (31.6 KiB) Viewed 7348 times
Steve
SAN Developer
There are 10 types of people in the world - those that understand binary and those that don't
steve1376656734
 
Posts: 334
Joined: Fri Aug 16, 2013 2:38 pm
Location: Ashford, UK

Re: Servoy 2022.09 release candidate 1

Postby lvostinar » Tue Sep 13, 2022 1:54 pm

steve1376656734 wrote:OK - looks like the versions of the component packages that are installed when you create a new project are out of date (2022.3 etc.) and you need to update them before your project will complete it's first build.


Hi Steve, indeed you need 2022.09 library versions to work with 2022.09 Servoy Developer. We included that information in release notes:
Make sure you use all the latest webpackages that also have the 2022.09.x version
Older versions won't work in combination with Servoy 2022.09


Not sure why you would have old libraries attached, for me it works fine, if you can reproduce this, please create a case.
Laurian Vostinar
Servoy
lvostinar
 
Posts: 1064
Joined: Tue Feb 19, 2008 10:53 am

Re: Servoy 2022.09 release candidate 1

Postby lvostinar » Tue Sep 13, 2022 2:00 pm

steve1376656734 wrote:Tried to import a solution exported from 2022.06 and got the following error:

Code: Select all
Could not import solution: org.json.JSONException: JSONObject["uuid"] not found.

The solution was the one attached to SVY-17427


I import the sample from https://support.servoy.com/browse/SVY-17427 without any issues, can you post the full error (with stacktrace) from the log(s) ?
Laurian Vostinar
Servoy
lvostinar
 
Posts: 1064
Joined: Tue Feb 19, 2008 10:53 am

Re: Servoy 2022.09 release candidate 1

Postby Andrei Costescu » Tue Sep 13, 2022 2:34 pm

You are right about onBeforeHide Steve. I will change the RC release notes (probably later today). Until then, you can have a look at SVY-17166 description / comments for information on why it was needed and how it can be used.
Can you can create a case for the missing column/row decorations in properties view?
Andrei Costescu
Servoy
Andrei Costescu
 
Posts: 1018
Joined: Tue Jun 26, 2007 3:14 pm

Re: Servoy 2022.09 release candidate 1

Postby steve1376656734 » Tue Sep 13, 2022 3:45 pm

Case SVY-17450 created for the column/row decorations
Steve
SAN Developer
There are 10 types of people in the world - those that understand binary and those that don't
steve1376656734
 
Posts: 334
Joined: Fri Aug 16, 2013 2:38 pm
Location: Ashford, UK

Re: Servoy 2022.09 release candidate 1

Postby steve1376656734 » Tue Sep 13, 2022 3:47 pm

Looks like all my issues with packages, building NG2 and importing solutions were to do with a messed up workspace. I have created a brand new workspace and everything now works as expected.
Steve
SAN Developer
There are 10 types of people in the world - those that understand binary and those that don't
steve1376656734
 
Posts: 334
Joined: Fri Aug 16, 2013 2:38 pm
Location: Ashford, UK

Re: Servoy 2022.09 release candidate 1

Postby emera » Tue Sep 13, 2022 4:05 pm

steve1376656734 wrote:Case SVY-17450 created for the column/row decorations

The changes for the grid lines and background are on purpose.
This is part of the new design for the Servoy default theme (still under discussion).
emera
 
Posts: 44
Joined: Tue Jun 17, 2014 8:33 am

Re: Servoy 2022.09 release candidate 1

Postby huber » Tue Sep 13, 2022 9:14 pm

2022.9 looks way better. 2022.6 looks quite old fashioned to me.

Regards,
Robert Huber
7r AG, Switzerland
SAN Developer
http://www.seven-r.ch
User avatar
huber
 
Posts: 518
Joined: Mon May 14, 2012 11:31 pm

Re: Servoy 2022.09 release candidate 1

Postby Andrei Costescu » Tue Sep 13, 2022 9:28 pm

Right Edit, theme changes :o . I forgot about those.

You can check the release notes again (it's updated) for more information about the new "onBeforeHide" event.
Andrei Costescu
Servoy
Andrei Costescu
 
Posts: 1018
Joined: Tue Jun 26, 2007 3:14 pm


Return to Latest Releases

Who is online

Users browsing this forum: No registered users and 1 guest